{"text_format":"3","workbook":"xlsx","n_sheets":5,"sheets":["Bilgi Girişi","Personel Bilgileri","Bordro","Gündelikler","Yasal Dayanak"],"not_rendered":{"macros":1,"defined_names":1,"comments":1},"read":"whole","date_system":"1900"}

{"sheet":"Bilgi Girişi","index":0,"n_rows":22,"n_cols":12,"rows_kept":22,"merged":[[0,0,0,2],[1,1,1,2],[2,1,2,2],[3,0,3,2],[4,1,4,2],[5,1,5,2],[6,1,6,2],[8,0,8,1],[9,0,9,1],[10,0,10,1],[11,0,11,1],[12,0,12,1],[13,0,13,1]]}
["YURİÇİ / YURTDIŞI GEÇİCİ GÖREV YOLLUĞU BİLGİ GİRİŞİ"]
["AİT OLDUĞU YIL / BÜTÇE YILI :",2020,{"$nulls":9},2015]
["KURUM  / OKUL ADI :","MAREŞAL",{"$nulls":9},2016]
["BİRİM YETKİLİSİ / OKUL / KURUM MÜDÜRÜ",{"$nulls":10},2017]
["ADI SOYADI :","M. Sait ÖZYURT",{"$nulls":9},2018]
["UNVANI :","Okul Müdürü",{"$nulls":9},2019]
["Düzenleme Tarihi :","2020-03-23",{"$nulls":9},2020]
[{"$nulls":11},2021]
["MERKEZİ YÖNETİM BÜTÇE KANUNU H CETVELİ",null,2020,{"$nulls":8},2022]
["a) Ek göstergesi 8000 ve daha yüksek olan kadrolarda bulunanlar (1) :",null,{"$f":"HLOOKUP($C$9,Gündelikler!$B$3:$V$8,2,FALSE)","v":{"v":56.1,"d":"56.10"}},{"$nulls":8},2023]
["b) Ek göstergesi 5800 ( dahil )-8000 ( hariç ) olan kadrolarda bulunanlar (2) :",null,{"$f":"HLOOKUP($C$9,Gündelikler!$B$3:$V$8,3,FALSE)","v":52.35},{"$nulls":8},2024]
["c) Ek göstergesi 3000 ( dahil )-5800 ( hariç ) olan kadrolarda bulunanlar :",null,{"$f":"HLOOKUP($C$9,Gündelikler!$B$3:$V$8,4,FALSE)","v":49.15},{"$nulls":8},2025]
["d) Aylık / kadro derecesi 1-4 olanlar, :",null,{"$f":"HLOOKUP($C$9,Gündelikler!$B$3:$V$8,5,FALSE)","v":43.34},{"$nulls":8},2026]
["e) Aylık / kadro derecesi 5-15 olanlar, :",null,{"$f":"HLOOKUP($C$9,Gündelikler!$B$3:$V$8,6,FALSE)","v":42.15},{"$nulls":8},2027]
[{"$nulls":11},2028]
[{"$nulls":11},2029]
[{"$nulls":11},2030]
[{"$nulls":11},2031]
[{"$nulls":11},2032]
[{"$nulls":11},2033]
[{"$nulls":11},2034]
[{"$nulls":11},2035]

{"sheet":"Personel Bilgileri","index":1,"n_rows":40,"n_cols":31,"rows_kept":40,"merged":[[0,0,0,1],[0,3,0,5]]}
["PERSONEL BİLGİLERİ GİRİŞİ",null,null,"GEÇİCİ GÖREV YOLLUĞU BİLGİLERİ"]
["Adı Soyadı :","MEHMET SAİT",null,null,"GİDİŞ BİLGİLERİ","DÖNÜŞ BİLGİLERİ"]
["Unvanı :","Öğretmen",null,"Nereden Nereye Gittiği :","Erzurum","Hatay",{"$nulls":4},"E K    G Ö S T E R G E",{"$nulls":9},"Ünvanı",null,"Gündelik (Yevmiye)",{"$nulls":4},"Derece","Kademe"]
["T.C. Kimlik No :","www.HangiSoru.com",null,"Tarihi :","05/09/2020","11/09/2020",{"$nulls":4},"SIRA","Müdür","Md.Yrd.","Öğret.","Memur (lise)","Memur (Ün.)","Hizmetli","ErÖğrt",{"$nulls":6},"Mutat","OTOBÜS"]
["Banka Şube Adı :",null,null,"Saati :","08:00","14:00",{"$nulls":5},1,2,3,4,5,6,7,null,null,"Öğretmen",null,{"$f":"'Bilgi Girişi'!C10","v":{"v":56.1,"d":"56.10"}},null,"Resmi","MİNİBÜS",null,1,1,null,0.3333333333333333]
["Banka Hesap No (IBAN) :",null,null,"Yol Gün Sayısı :",1.3333333333333333,1.3333333333333333,{"$nulls":4},1,3000,3000,3000,1500,2200,1500,3000,null,null,"Memur 1",null,{"$f":"'Bilgi Girişi'!C11","v":52.35},null,null,"TAKSİ",null,2,2,null,0.5]
["Derece :",5,null,"Şehiriçi Ulaşım Yeri :","İkamet - Terminal","Görev Yeri - Terminal",{"$nulls":4},2,2200,2200,2200,1100,1600,1100,2200,null,null,"Memur 2",null,{"$f":"'Bilgi Girişi'!C12","v":49.15},null,null,"AMBULANS",null,3,3,null,0.6666666666666666]
["Kademe :",1,null,"Şehiriçi Ulaşım Çeşidi :","Taksi","Otobüs",{"$nulls":4},3,1600,1600,1600,800,1100,800,1600,null,null,"Hizmetli",null,{"$f":"'Bilgi Girişi'!C13","v":43.34},{"$nulls":4},4,4,null,1]
["Damga Vergisi (‰) :",7.59,null,"Şehiriçi Ulaşım Ücreti :",{"v":15,"d":"15.00"},{"v":10,"d":"10.00"},{"$nulls":4},4,1100,1100,1100,650,800,650,1100,{"$nulls":4},{"$f":"'Bilgi Girişi'!C14","v":42.15},{"$nulls":4},5,5,null,1.3333333333333333]
["Ek Göstergesi :",{"$f":"IF(B2=\"\",\"\",IF(B2=\"\",\"\",IF(B3=\"ÖĞRETMEN\",INDEX($L$6:$L$18,$B7),0))+IF(B2=\"\",\"\",IF(B3=\"MEMUR 1\",INDEX($O$6:$O$18,$B7),0))+IF(B2=\"\",\"\",IF(B3=\"MEMUR 2\",INDEX($P$6:$P$18,$B7),0))+IF(B2=\"\",\"\",IF(B3=\"HİZMETLİ\",INDEX($Q$6:$Q$18,$B7),0)))","v":900},null,"Yol Gideri Çeşidi :","Mutat","Mutat",{"$nulls":4},5,900,900,900,0,0,0,900,{"$nulls":9},6,6,null,1.5]
["Gündeliği :",{"$f":"IF(B2=\"\",\"\",IF(B10=\"\",$W$9,IF(B10<=900,$W$9,IF(B10<=2200,$W$8,IF(B10<=3000,$W$7,IF(B10>=5800,$W$6))))))","v":42.15},null,"Yol Gideri Ücreti :",{"v":50,"d":"50.00"},{"v":50,"d":"50.00"},{"$nulls":4},6,800,800,800,0,0,0,800,{"$nulls":9},7,7,null,1.6666666666666665]
[{"$nulls":3},"Şehiriçi Ulaşım Yeri :","Terminal - Görev Yeri","Terminal - İkamet",{"$nulls":4},7,500,500,500,0,0,0,500,{"$nulls":9},8,null,null,2]
["Konaklama Süresi :",2,null,"Şehiriçi Ulaşım Çeşidi :","Minibüs","Dolmuş",{"$nulls":4},8,450,450,450,0,0,0,450,{"$nulls":9},9,null,null,2.3333333333333335]
["Konaklama Ücreti :",126.45,null,"Şehiriçi Ulaşım Ücreti :",{"v":10,"d":"10.00"},{"v":5,"d":"5.00"},{"$nulls":4},9,0,0,0,0,0,0,0,{"$nulls":9},10,null,null,2.5]
[{"$nulls":10},10,0,0,0,0,0,0,0,{"$nulls":9},11,null,null,2.6666666666666665]
[{"$nulls":10},11,0,0,0,0,0,0,0,{"$nulls":9},12,null,null,3]
[{"$nulls":10},12,0,0,0,0,0,0,0,{"$nulls":9},14,null,null,3.33333333333333]
[{"$nulls":10},13,0,0,0,0,0,0,0,{"$nulls":9},13,null,null,3.5]
[{"$nulls":10},14,0,0,0,0,0,0,0,{"$nulls":9},15,null,null,3.66666666666667]
[{"$nulls":10},15,0,0,0,0,0,0,0,{"$nulls":12},4]
[{"$nulls":30},4.33333333333333]
[{"$nulls":30},4.5]
[{"$nulls":30},4.66666666666667]
[{"$nulls":30},5]
[{"$nulls":30},5.33333333333333]
[{"$nulls":30},5.5]
[{"$nulls":30},5.66666666666667]
[{"$nulls":30},6]
[{"$nulls":30},6.33333333333333]
[{"$nulls":30},6.5]
[{"$nulls":30},6.66666666666667]
[{"$nulls":30},7]
[{"$nulls":30},7.33333333333333]
[{"$nulls":30},7.5]
[{"$nulls":30},7.66666666666667]
[{"$nulls":30},8]
[{"$nulls":30},8.33333333333333]
[{"$nulls":30},8.5]
[{"$nulls":30},8.66666666666667]
[{"$nulls":30},9]

{"sheet":"Bordro","index":2,"n_rows":28,"n_cols":13,"rows_kept":28,"merged":[[0,0,0,1],[0,3,0,9],[1,0,1,1],[1,11,1,12],[2,0,2,1],[2,11,2,12],[3,0,3,1],[3,10,4,11],[4,0,4,1],[5,0,6,1],[5,2,7,2],[5,3,5,4],[5,5,5,7],[5,8,5,9],[5,10,5,11],[5,12,6,12],[6,3,7,3],[6,4,7,4],[6,5,7,5],[6,8,7,8],[6,10,7,10],[19,0,19,3],[21,0,21,12],[22,0,22,1],[22,3,22,5],[22,11,22,12],[24,5,24,9],[24,11,24,12],[25,3,25,4],[25,5,25,9],[25,11,25,12],[26,3,26,4],[26,5,26,9],[26,11,26,12],[27,3,27,4],[27,5,27,9],[27,11,27,12]]}
["Adı Soyadı :",null,{"$f":"'Personel Bilgileri'!B2","v":"MEHMET SAİT"}," YURTİÇİ / YURTDIŞI GEÇİCİ GÖREV YOLLUĞU BİLDİRİMİ"]
["Ünvanı :",null,{"$f":"'Personel Bilgileri'!B3","v":"Öğretmen"},{"$nulls":7},"Dairesi :",{"$f":"'Bilgi Girişi'!B3","v":"MAREŞAL"}]
["Kadro / Derece :",null,{"$f":"CONCATENATE('Personel Bilgileri'!B7,\"/\",'Personel Bilgileri'!B8)","v":"5/1"},{"$nulls":7},"Bütçe Yılı :",{"$f":"'Bilgi Girişi'!B2","v":2020}]
["Ek Göstergesi :",null,{"$f":"'Personel Bilgileri'!B10","v":900},{"$nulls":7},"Önceden Avans Almışsa Aldığı Saymanlık ve Tarihi :"]
["Gündeliği :",null,{"$f":"'Personel Bilgileri'!B11","v":42.15}]
["Yolculuk ve Oturma\nTarihleri",null,"Nereden Nereye\nYolculuk Edildiği Veya\nNerede Oturduğu","HAREKET SAATLERİ",null,"GÜNDELİKLER",null,null,"TAŞIT ve ZORUNLU GİDERLER",null,"Dövizin",null,"Toplam Tutar"]
[{"$nulls":3},"Gidiş","Dönüş","Gün Sayısı","Bir Günlüğü","Tutarı","Çeşidi / Mevki","Tutarı","Cinsi","Kuru"]
["Gidiş Tarihi","Dönüş Tarihi",{"$nulls":4},"TL / Yabancı Para","TL / Yabancı Para",null,"TL / Yabancı Para",null,"TL","TL"]
[{"$f":"IF($C$1=\"\",\"\",'Personel Bilgileri'!E4)","v":"05/09/2020"},null,{"$f":"IF(A9>0,\"Yevmiye\",\"\")","v":"Yevmiye"},null,null,{"$f":"'Personel Bilgileri'!E6","v":1.3333333333333333},{"$f":"IF('Personel Bilgileri'!E6=\"\",\"\",$C$5)","v":42.15},{"$f":"IF(F9>0,(F9*G9),\"\")","v":{"v":56.199999999999996,"d":"56.20"}},{"$nulls":4},{"$f":"IF($C$1=\"\",\"\",SUM(H9:J9))","v":{"v":56.199999999999996,"d":"56.20"}}]
[{"$f":"IF($C$1=\"\",\"\",'Personel Bilgileri'!E4)","v":"05/09/2020"},null,{"$f":"'Personel Bilgileri'!E7","v":"İkamet - Terminal"},{"$nulls":5},{"$f":"'Personel Bilgileri'!E8","v":"Taksi"},{"$f":"'Personel Bilgileri'!E9","v":{"v":15,"d":"15.00"}},null,null,{"v":15,"d":"15.00"}]
[{"$f":"IF($C$1=\"\",\"\",'Personel Bilgileri'!E4)","v":"05/09/2020"},null,{"$f":"IF(C1=\"\",\"\",(CONCATENATE('Personel Bilgileri'!E3,\" - \",'Personel Bilgileri'!F3,\"\")))","v":"Erzurum - Hatay"},{"$f":"'Personel Bilgileri'!E5","v":"08:00"},{"$nulls":4},{"$f":"'Personel Bilgileri'!E10","v":"Mutat"},{"$f":"'Personel Bilgileri'!E11","v":{"v":50,"d":"50.00"}},null,null,{"v":50,"d":"50.00"}]
[null,null,{"$f":"'Personel Bilgileri'!E12","v":"Terminal - Görev Yeri"},{"$nulls":5},{"$f":"'Personel Bilgileri'!E13","v":"Minibüs"},{"$f":"'Personel Bilgileri'!E14","v":{"v":10,"d":"10.00"}},null,null,{"v":10,"d":"10.00"}]
[{"$f":"IF($C$1=\"\",\"\",'Personel Bilgileri'!E4)","v":"05/09/2020"},{"$f":"IF($C$1=\"\",\"\",'Personel Bilgileri'!F4)","v":"11/09/2020"},{"$f":"IF('Personel Bilgileri'!B13>1,\"Konaklama\",\"\")","v":"Konaklama"},null,null,{"$f":"IF('Personel Bilgileri'!B13>1,'Personel Bilgileri'!B13,\"\")","v":2},{"$f":"IF('Personel Bilgileri'!B13>1,$C$5,\"\")","v":42.15},{"$f":"'Personel Bilgileri'!B14","v":126.45},{"$nulls":4},126.45]
[null,{"$f":"IF($C$1=\"\",\"\",'Personel Bilgileri'!F4)","v":"11/09/2020"},{"$f":"IF(A9>0,\"Yevmiye\",\"\")","v":"Yevmiye"},null,null,{"$f":"'Personel Bilgileri'!F6","v":1.3333333333333333},{"$f":"IF('Personel Bilgileri'!F6=\"\",\"\",$C$5)","v":42.15},{"$f":"IF(F14>0,(F14*G14),\"\")","v":{"v":56.199999999999996,"d":"56.20"}},{"$nulls":4},{"v":56.199999999999996,"d":"56.20"}]
[null,null,{"$f":"'Personel Bilgileri'!F7","v":"Görev Yeri - Terminal"},{"$nulls":5},{"$f":"'Personel Bilgileri'!F8","v":"Otobüs"},{"$f":"'Personel Bilgileri'!F9","v":{"v":10,"d":"10.00"}},null,null,{"v":10,"d":"10.00"}]
[null,{"$f":"IF($C$1=\"\",\"\",'Personel Bilgileri'!F4)","v":"11/09/2020"},{"$f":"IF(C1=\"\",\"\",(CONCATENATE('Personel Bilgileri'!F3,\" - \",'Personel Bilgileri'!E3,\"\")))","v":"Hatay - Erzurum"},null,{"$f":"'Personel Bilgileri'!F5","v":"14:00"},{"$nulls":3},{"$f":"'Personel Bilgileri'!F10","v":"Mutat"},{"$f":"'Personel Bilgileri'!F11","v":{"v":50,"d":"50.00"}},null,null,{"v":50,"d":"50.00"}]
[null,{"$f":"IF($C$1=\"\",\"\",'Personel Bilgileri'!F4)","v":"11/09/2020"},{"$f":"'Personel Bilgileri'!F12","v":"Terminal - İkamet"},{"$nulls":5},{"$f":"'Personel Bilgileri'!F13","v":"Dolmuş"},{"$f":"'Personel Bilgileri'!F14","v":{"v":5,"d":"5.00"}},null,null,{"$f":"IF($C$1=\"\",\"\",SUM(H17:J17))","v":{"v":5,"d":"5.00"}}]
[{"$nulls":12},{"$f":"IF($C$1=\"\",\"\",SUM(H18:J18))","v":{"v":0,"d":"0.00"}}]
[{"$nulls":12},{"$f":"IF($C$1=\"\",\"\",SUM(H19:J19))","v":{"v":0,"d":"0.00"}}]
["GENEL TOPLAM",{"$nulls":6},{"$f":"SUM(H9:H19)","v":238.85},null,{"$f":"SUM(J9:J19)","v":{"v":140,"d":"140.00"}},null,null,{"$f":"SUM(M9:M19)","v":{"v":378.84999999999997,"d":"378.85"}}]
[]
[{"$f":"CONCATENATE(\"     Yukarıda belirtilen tarihler / saatler arasında yapmış olduğu geçici görev yolluğu ile ilgili olarak \",C1,\" tahakkuk eden \",M20,\" TL\",\" gösterir bildirimdir.\")","v":"     Yukarıda belirtilen tarihler / saatler arasında yapmış olduğu geçici görev yolluğu ile ilgili olarak MEHMET SAİT tahakkuk eden 378,85 TL gösterir bildirimdir."}]
[{"$nulls":11},{"$f":"'Bilgi Girişi'!B7","v":"2020-03-23"}]
[]
[{"$nulls":5},"Birim Yetkilisi",{"$nulls":5},"Bildirim Sahibi (İmza)"]
[{"$nulls":3},"Adı Soyadı :",null,{"$f":"'Bilgi Girişi'!B5","v":"M. Sait ÖZYURT"},{"$nulls":5},{"$f":"C1","v":"MEHMET SAİT"}]
[{"$nulls":3},"Ünvanı :",null,{"$f":"'Bilgi Girişi'!B6","v":"Okul Müdürü"},{"$nulls":5},{"$f":"C2","v":"Öğretmen"}]
[{"$nulls":3},"İmzası :",null,".................................."]

{"sheet":"Gündelikler","index":3,"n_rows":27,"n_cols":22,"rows_kept":27,"merged":[[0,0,0,21],[1,0,2,0],[1,1,1,21],[9,1,9,8],[9,12,9,16],[10,10,24,10]]}
["MEMURLARIN GEÇİCİ GÖREV YOLLUĞU PERSONEL YEVMİYELERİ (GÜNDELİKLERİ):"]
["MERKEZİ YÖNETİM BÜTÇE KANUNU H CETVELİ","YILLAR"]
[null,2015,2016,2017,2018,2019,2020,2021,2022,2023,2024,2025,2026,2027,2028,2029,2030,2031,2032,2033,2034,2035]
["a) Ek göstergesi 8000 ve daha yüksek olan kadrolarda bulunanlar (1)",{"v":43,"d":"43.00"},45.92,48.25,{"v":51.6,"d":"51.60"},{"v":51.6,"d":"51.60"},{"v":56.1,"d":"56.10"}]
["b) Ek göstergesi 5800 ( dahil )-8000 ( hariç ) olan kadrolarda bulunanlar (2)",{"v":40,"d":"40.00"},42.72,{"v":45,"d":"45.00"},48.15,48.15,52.35]
["c) Ek göstergesi 3000 ( dahil )-5800 ( hariç ) olan kadrolarda bulunanlar ",{"v":37.5,"d":"37.50"},40.05,42.25,{"v":45.2,"d":"45.20"},{"v":45.2,"d":"45.20"},49.15]
["d) Aylık / kadro derecesi 1-4 olanlar,",{"v":33,"d":"33.00"},35.24,37.25,39.85,39.85,43.34]
["e) Aylık / kadro derecesi 5-15 olanlar,",{"v":32,"d":"32.00"},34.18,36.25,38.75,38.75,42.15]
[]
[null,"E K    G Ö S T E R G E",{"$nulls":10},"EK GÖSTERGE"]
[null,"SIRA","Müdür","Md.Yrd.","Öğret.","Memur (lise)","Memur (Ün.)","Hizmetli","ErÖğrt",null,"DERECE",1,3000,0,null,2200,1500]
[null,null,1,2,3,4,5,6,7,null,null,2,2200,0,null,1600,1100]
[null,1,3000,3000,3000,1500,2200,1500,3000,null,null,3,1600,0,null,1500,800]
[null,2,2200,2200,2200,1100,1600,1100,2200,null,null,4,1100,0,null,1100,650]
[null,3,1600,1600,1600,800,1100,800,1600,null,null,5,900,0,null,1050,0]
[null,4,1100,1100,1100,650,800,650,1100,null,null,6,800,0,null,1050,0]
[null,5,900,900,900,0,0,0,900,null,null,7,500,0,null,1050,0]
[null,6,800,800,800,0,0,0,800,null,null,8,450,0,null,1050,0]
[null,7,500,500,500,0,0,0,500,null,null,9,0,0,null,1050,0]
[null,8,450,450,450,0,0,0,450,null,null,10,0,0,null,1050,0]
[null,9,0,0,0,0,0,0,0,null,null,11,0,0,null,1050,0]
[null,10,0,0,0,0,0,0,0,null,null,12,0,0,null,1050,0]
[null,11,0,0,0,0,0,0,0,null,null,13,0,0,null,1050,0]
[null,12,0,0,0,0,0,0,0,null,null,14,0,0,null,1050,0]
[null,13,0,0,0,0,0,0,0,null,null,15,0,0,null,1050,0]
[null,14,0,0,0,0,0,0,0]
[null,15,0,0,0,0,0,0,0]

{"sheet":"Yasal Dayanak","index":4,"n_rows":8,"n_cols":2,"rows_kept":8,"merged":[[1,1,2,2],[3,1,3,2],[4,1,4,2],[5,1,5,2],[6,1,6,2],[7,1,7,2]]}
[]
[null,"GEÇİCİ GÖREV YOLLUĞU YASAL DAYANAĞI"]
[]
[null,"HARCIRAH KANUNU (1)"]
[null,"          Kanun Numarası             : 6245"]
[null,"          Kabul Tarihi                    : 10/2/1954"]
[null,"          Yayımlandığı R.Gazete   : Tarih : 18/2/1954   Sayı : 8637"]
[null,"          Yayımlandığı Düstur       : Tertip : 3   Cilt : 35   Sayfa : 321"]